Target
Peroxisome proliferator-activated receptor gamma
Ligand
BDBM50103938
Substrate
Meas. Tech.
ChEBML_154050
EC50
79±n/a nM
Citation
 Liu, KGSmith, JSAyscue, AHHenke, BRLambert, MHLeesnitzer, LMPlunket, KDWillson, TMSternbach, DD Identification of a series of oxadiazole-substituted alpha-isopropoxy phenylpropanoic acids with activity on PPARalpha, PPARgamma, and PPARdelta. Bioorg Med Chem Lett 11:2385-8 (2001)  
Target
Name:
Peroxisome proliferator-activated receptor gamma
Synonyms:
NR1C3 PPAR-gamma PPARG_HUMAN Peroxisome proliferator-activated receptor gamma (PPAR gamma) Peroxisome proliferator-activated receptor gamma (PPARĪ³) peroxisome proliferator-activated receptor gamma isoform 2
Type:
Nuclear Receptor
Mol. Mass.:
57613.46
Organism:
Homo sapiens (Human)
Description:
P37231
Residue:
505
  
Inhibitor
Name:
BDBM50103938
Synonyms:
2-Isopropoxy-3-[4-(5-phenyl-[1,2,4]oxadiazol-3-ylmethoxy)-phenyl]-propionic acid CHEMBL311429
Type:
Small organic molecule
Emp. Form.:
C21H22N2O5
Mol. Mass.:
382.4098
SMILES:
CC(C)OC(Cc1ccc(OCc2noc(n2)-c2ccccc2)cc1)C(O)=O
: