Target
Bromodomain-containing protein 1
Ligand
BDBM50504160
Substrate
Meas. Tech.
ChEMBL_1998340 (CHEMBL4650197)
Kd
1653±n/a nM
Citation
 Picaud, SLeonards, KLambert, JPDovey, OWells, CFedorov, OMonteiro, OFujisawa, TWang, CYLingard, HTallant, CNikbin, NGuetzoyan, LIngham, RLey, SVBrennan, PMuller, SSamsonova, AGingras, ACSchwaller, JVassiliou, GKnapp, SFilippakopoulos, P Promiscuous targeting of bromodomains by bromosporine identifies BET proteins as master regulators of primary transcription response in leukemia. Sci Adv 2:0 (2016) Target
Name:
Bromodomain-containing protein 1
Synonyms:
BR140-like protein BRD1_HUMAN BRL Bromodomain and PHD finger-containing protein 2 | Bromodomain-containing protein 1
Type:
PROTEIN
Mol. Mass.:
119557.65
Organism:
Homo sapiens (Human)
Description:
ChEMBL_105349
Residue:
1058
  
Inhibitor
Name:
BDBM50504160
Synonyms:
CHEMBL3133807 | US11773085, Compound B25
Type:
Small organic molecule
Emp. Form.:
C17H20N6O4S
Mol. Mass.:
404.444
SMILES:
CCOC(=O)Nc1cc(nn2c(C)nnc12)-c1ccc(C)c(NS(C)(=O)=O)c1
: