Target
Membrane primary amine oxidase
Ligand
BDBM50104435
Substrate
Meas. Tech.
ChEMBL_200171 (CHEMBL810015)
Ki
27000±n/a nM
Citation
 Conn, CShimmon, RCordaro, FHargraves, TLIbrahim, P Combinatorial synthesis of SSAO inhibitors using sonogashira coupling: SAR of aryl propargylic amines. Bioorg Med Chem Lett 11:2565-8 (2001)  
Target
Name:
Membrane primary amine oxidase
Synonyms:
AOC3_RAT Aoc3 Vascular adhesion protein 1 (VAP-1)
Type:
Enzyme
Mol. Mass.:
84979.78
Organism:
Rattus norvegicus (Rat)
Description:
O08590
Residue:
763
  
Inhibitor
Name:
BDBM50104435
Synonyms:
4-(6-Guanidino-hexanoyloxy)-benzoic acid ethyl ester | CHEMBL87563
Type:
Small organic molecule
Emp. Form.:
C16H23N3O4
Mol. Mass.:
321.3715
SMILES:
CCOC(=O)c1ccc(OC(=O)CCCCCNC(N)=N)cc1
: