Target
Membrane primary amine oxidase
Ligand
BDBM50016897
Substrate
Meas. Tech.
ChEMBL_200171 (CHEMBL810015)
Ki
900000±n/a nM
Citation
 Conn, CShimmon, RCordaro, FHargraves, TLIbrahim, P Combinatorial synthesis of SSAO inhibitors using sonogashira coupling: SAR of aryl propargylic amines. Bioorg Med Chem Lett 11:2565-8 (2001)  
Target
Name:
Membrane primary amine oxidase
Synonyms:
AOC3_RAT Aoc3 Vascular adhesion protein 1 (VAP-1)
Type:
Enzyme
Mol. Mass.:
84979.78
Organism:
Rattus norvegicus (Rat)
Description:
O08590
Residue:
763
  
Inhibitor
Name:
BDBM50016897
Synonyms:
2-(2,6-dichloroanilino)-1,3-diazacyclopentene-(2) CLONIDINE clonidine (amino form)
Type:
Small organic molecule
Emp. Form.:
C9H9Cl2N3
Mol. Mass.:
230.094
SMILES:
Clc1cccc(Cl)c1\[#7]=[#6]-1\[#7]-[#6]-[#6]-[#7]-1
: