Target
Membrane primary amine oxidase
Ligand
BDBM50104437
Substrate
Meas. Tech.
ChEBML_200170
Ki
2900±n/a nM
Citation
 Conn, CShimmon, RCordaro, FHargraves, TLIbrahim, P Combinatorial synthesis of SSAO inhibitors using sonogashira coupling: SAR of aryl propargylic amines. Bioorg Med Chem Lett 11:2565-8 (2001)  
Target
Name:
Membrane primary amine oxidase
Synonyms:
AOC3_RAT Aoc3 Vascular adhesion protein 1 (VAP-1)
Type:
Enzyme
Mol. Mass.:
84979.78
Organism:
Rattus norvegicus (Rat)
Description:
O08590
Residue:
763
  
Inhibitor
Name:
BDBM50104437
Synonyms:
CHEMBL312832 | [3-(3,4-Dimethoxy-phenyl)-prop-2-ynyl]-dimethyl-amine
Type:
Small organic molecule
Emp. Form.:
C13H17NO2
Mol. Mass.:
219.2796
SMILES:
COc1ccc(cc1OC)C#CCN(C)C
: