Target
Androgen receptor
Ligand
BDBM50432188
Substrate
Meas. Tech.
ChEMBL_2014755 (CHEMBL4668333)
Ki
5000±n/a nM
Citation
 Hanan, EJLiang, JWang, XBlake, RABlaquiere, NStaben, ST Monomeric Targeted Protein Degraders. J Med Chem 63:11330-11361 (2020)  
Target
Name:
Androgen receptor
Synonyms:
ANDR_HUMAN Androgen Receptor Androgen receptor/Baculoviral IAP repeat-containing protein 2 Dihydrotestosterone receptor Nuclear receptor subfamily 3 group C member 4
Type:
Receptor
Mol. Mass.:
99185.27
Organism:
Homo sapiens (Human)
Description:
CHO cells were stably transfected with human AR gene.
Residue:
920
  
Inhibitor
Name:
BDBM50432188
Synonyms:
CHEMBL2346976
Type:
Small organic molecule
Emp. Form.:
C25H32F3N7O2
Mol. Mass.:
519.5625
SMILES:
CC(=O)N1CCN(CCOc2ccc(cc2)C2CCN(CC2)C2=Nn3c(CC2)nnc3C(F)(F)F)CC1
: