Target
Matrix metalloproteinase-14
Ligand
BDBM50104723
Substrate
Meas. Tech.
ChEMBL_106783 (CHEMBL718390)
Ki
150±n/a nM
Citation
 Schröder, JHenke, AWenzel, HBrandstetter, HStammler, HGStammler, APfeiffer, WDTschesche, H Structure-based design and synthesis of potent matrix metalloproteinase inhibitors derived from a 6H-1,3,4-thiadiazine scaffold. J Med Chem 44:3231-43 (2001)  
Target
Name:
Matrix metalloproteinase-14
Synonyms:
MMP-14 MMP14 MT-MMP 1 MT1MMP Matrix Metalloproteinase-14 (MMP-14) Matrix metalloproteinase-14 Membrane-type matrix metalloproteinase 1 | Membrane-type-1 matrix metalloproteinase
Type:
Protein
Mol. Mass.:
65900.19
Organism:
Homo sapiens (Human)
Description:
P50281
Residue:
582
  
Inhibitor
Name:
BDBM50104723
Synonyms:
2-Benzenesulfonylamino-N-[5-(4-chloro-phenyl)-6H-[1,3,4]thiadiazin-2-yl]-2-methyl-propionamide | CHEMBL109806
Type:
Small organic molecule
Emp. Form.:
C19H19ClN4O3S2
Mol. Mass.:
450.962
SMILES:
CC(C)(NS(=O)(=O)c1ccccc1)C(=O)NC1=NN=C(CS1)c1ccc(Cl)cc1
: