Target
Matrix metalloproteinase-9
Ligand
BDBM50104711
Substrate
Meas. Tech.
ChEMBL_105381 (CHEMBL710801)
Ki
170±n/a nM
Citation
 Schröder, JHenke, AWenzel, HBrandstetter, HStammler, HGStammler, APfeiffer, WDTschesche, H Structure-based design and synthesis of potent matrix metalloproteinase inhibitors derived from a 6H-1,3,4-thiadiazine scaffold. J Med Chem 44:3231-43 (2001)  
Target
Name:
Matrix metalloproteinase-9
Synonyms:
67 kDa matrix metalloproteinase-9 92 kDa gelatinase CLG4B Gelatinase B MMP9 Matrix metalloproteinase 9 (MMP-9) Matrix metalloproteinase-9 (MMP9)
Type:
Enzyme
Mol. Mass.:
78452.28
Organism:
Homo sapiens (Human)
Description:
P14780
Residue:
707
  
Inhibitor
Name:
BDBM50104711
Synonyms:
2-Benzenesulfonylamino-N-[5-(5-chloro-thiophen-2-yl)-6H-[1,3,4]thiadiazin-2-yl]-propionamide | CHEMBL111678
Type:
Small organic molecule
Emp. Form.:
C16H15ClN4O3S3
Mol. Mass.:
442.963
SMILES:
C[C@H](NS(=O)(=O)c1ccccc1)C(=O)NC1=NN=C(CS1)c1ccc(Cl)s1
: