Target
Neutrophil collagenase
Ligand
BDBM50104708
Substrate
Meas. Tech.
ChEMBL_105197 (CHEMBL713836)
Ki
180±n/a nM
Citation
 Schröder, JHenke, AWenzel, HBrandstetter, HStammler, HGStammler, APfeiffer, WDTschesche, H Structure-based design and synthesis of potent matrix metalloproteinase inhibitors derived from a 6H-1,3,4-thiadiazine scaffold. J Med Chem 44:3231-43 (2001)  
Target
Name:
Neutrophil collagenase
Synonyms:
CLG1 MMP8 Matrix metalloproteinase-8 PMNL collagenase | PMNL-CL
Type:
Enzyme
Mol. Mass.:
53413.48
Organism:
Homo sapiens (Human)
Description:
P22894
Residue:
467
  
Inhibitor
Name:
BDBM50104708
Synonyms:
(S)-N-(5-(4-methoxyphenyl)-6H-1,3,4-thiadiazin-2-yl)-2-(phenylsulfonamido)propanamide CHEMBL419750
Type:
Small organic molecule
Emp. Form.:
C19H20N4O4S2
Mol. Mass.:
432.516
SMILES:
COc1ccc(cc1)C1=NN=C(NC(=O)[C@H](C)NS(=O)(=O)c2ccccc2)SC1
: