Target
Matrix metalloproteinase-9
Ligand
BDBM50546208
Substrate
Meas. Tech.
ChEMBL_2014877 (CHEMBL4668455)
Kd
320±n/a nM
Citation
 Zipfel, PRochais, CBaranger, KRivera, SDallemagne, P Matrix Metalloproteinases as New Targets in Alzheimer's Disease: Opportunities and Challenges. J Med Chem 63:10705-10725 (2020)  
Target
Name:
Matrix metalloproteinase-9
Synonyms:
67 kDa matrix metalloproteinase-9 92 kDa gelatinase CLG4B Gelatinase B MMP9 Matrix metalloproteinase 9 (MMP-9) Matrix metalloproteinase-9 (MMP9)
Type:
Enzyme
Mol. Mass.:
78452.28
Organism:
Homo sapiens (Human)
Description:
P14780
Residue:
707
  
Inhibitor
Name:
BDBM50546208
Synonyms:
CHEMBL4762293
Type:
Small organic molecule
Emp. Form.:
C18H20FN3O2S
Mol. Mass.:
361.434
SMILES:
Fc1ccc(NC(=O)CCCSc2nc(=O)c3CCCCc3[nH]2)cc1
: