Target
Caspase-3
Ligand
BDBM50546262
Substrate
Meas. Tech.
ChEMBL_2015052 (CHEMBL4668630)
Ki
0.080±n/a nM
Citation
 Bancet, ARaingeval, CLomberget, TLe Borgne, MGuichou, JFKrimm, I Fragment Linking Strategies for Structure-Based Drug Design. J Med Chem 63:11420-11435 (2020)  
Target
Name:
Caspase-3
Synonyms:
Apopain CASP3 CPP-32 Caspase 3 Caspase-3 subunit p17 SCA-1 Yama protein | caspase-3 preproprotein
Type:
Hydrolase; heterotetramer of two heterodimers
Mol. Mass.:
31607.55
Organism:
Homo sapiens (Human)
Description:
Residue:
277
  
Inhibitor
Name:
BDBM50546262
Synonyms:
CHEMBL4751195
Type:
Small organic molecule
Emp. Form.:
C36H45N7O12
Mol. Mass.:
767.7822
SMILES:
CC(C)[C@H](NC(=O)[C@H](CCC(O)=O)NC(=O)[C@H](CC(O)=O)NC(C)=O)C(=O)N[C@@H](CC(O)=O)C(=O)CNc1ccc2oc(nc2c1)-c1ccc(cc1)N(C)C
: