Target
E-selectin
Ligand
BDBM50105202
Substrate
Meas. Tech.
ChEMBL_199699 (CHEMBL802927)
IC50
9±n/a nM
Citation
 Zhu, GDArendsen, DLGunawardana, IWBoyd, SAStewart, AOFry, DGCool, BLKifle, LSchaefer, VMeuth, JMarsh, KCKempf-Grote, AJKilgannon, PGallatin, WMOkasinski, GF Selective inhibition of ICAM-1 and E-selectin expression in human endothelial cells. 2. Aryl modifications of 4-(aryloxy)thieno[2,3-c]pyridines with fine-tuning at C-2 carbamides. J Med Chem 44:3469-87 (2001)  
Target
Name:
E-selectin
Synonyms:
ELAM1 SELE Selectin E
Type:
PROTEIN
Mol. Mass.:
66642.96
Organism:
Homo sapiens (Human)
Description:
ChEMBL_1438995
Residue:
610
  
Inhibitor
Name:
BDBM50105202
Synonyms:
4-(Biphenyl-4-yloxy)-thieno[2,3-c]pyridine-2-carboxylic acid methylamide | CHEMBL115637
Type:
Small organic molecule
Emp. Form.:
C21H16N2O2S
Mol. Mass.:
360.429
SMILES:
CNC(=O)c1cc2c(Oc3ccc(cc3)-c3ccccc3)cncc2s1
: