Target
E-selectin
Ligand
BDBM50105156
Substrate
Meas. Tech.
ChEMBL_199703 (CHEMBL803586)
IC50
4±n/a nM
Citation
 Zhu, GDArendsen, DLGunawardana, IWBoyd, SAStewart, AOFry, DGCool, BLKifle, LSchaefer, VMeuth, JMarsh, KCKempf-Grote, AJKilgannon, PGallatin, WMOkasinski, GF Selective inhibition of ICAM-1 and E-selectin expression in human endothelial cells. 2. Aryl modifications of 4-(aryloxy)thieno[2,3-c]pyridines with fine-tuning at C-2 carbamides. J Med Chem 44:3469-87 (2001)  
Target
Name:
E-selectin
Synonyms:
ELAM1 SELE Selectin E
Type:
PROTEIN
Mol. Mass.:
66642.96
Organism:
Homo sapiens (Human)
Description:
ChEMBL_1438995
Residue:
610
  
Inhibitor
Name:
BDBM50105156
Synonyms:
4-{4-[2-(2-Methoxy-ethoxy)-ethoxymethyl]-phenoxy}-thieno[2,3-c]pyridine-2-carboxylic acid methylamide | CHEMBL117279
Type:
Small organic molecule
Emp. Form.:
C21H24N2O5S
Mol. Mass.:
416.491
SMILES:
CNC(=O)c1cc2c(Oc3ccc(COCCOCCOC)cc3)cncc2s1
: