Target
Mitochondrial 2-oxodicarboxylate carrier
Ligand
BDBM50028197
Substrate
Meas. Tech.
ChEMBL_2015975 (CHEMBL4669553)
IC50
252000±n/a nM
Citation
 Schultz, CRGruhlke, MCHSlusarenko, AJBachmann, AS Allicin, a Potent New Ornithine Decarboxylase Inhibitor in Neuroblastoma Cells. J Nat Prod 83:2518-2527 (2020) Target
Name:
Mitochondrial 2-oxodicarboxylate carrier
Synonyms:
Mitochondrial 2-oxodicarboxylate carrier ODC_HUMAN Solute carrier family 25 member 21
Type:
PROTEIN
Mol. Mass.:
33315.79
Organism:
Homo sapiens
Description:
ChEMBL_120108
Residue:
299
  
Inhibitor
Name:
BDBM50028197
Synonyms:
2-(difluoromethyl)ornithine EFLORNITHINE
Type:
Small organic molecule
Emp. Form.:
C6H12F2N2O2
Mol. Mass.:
182.1685
SMILES:
NCCCC(N)(C(F)F)C(O)=O
: