Target
5-hydroxytryptamine receptor 2A
Ligand
BDBM50547388
Substrate
Meas. Tech.
ChEMBL_2017996 (CHEMBL4671574)
Ki
0.091000±n/a nM
Citation
 Watanabe, HIshida, KYamamoto, MHoriguchi, MIsobe, Y Synthesis and pharmacological evaluation of 11-(1,6-dimethyl-1,2,3,6-tetrahydropyridin-4-yl)-5H-dibenzo[b,e][1,4]diazepines with clozapine-like receptor occupancy at dopamine D Bioorg Med Chem Lett 30:0 (2020)  
Target
Name:
5-hydroxytryptamine receptor 2A
Synonyms:
5-HT-2 5-HT2A 5-hydroxytryptamine receptor 2A (5HT-2A) 5HT2A_HUMAN HTR2A | Serotonin receptor 2A
Type:
undefined
Mol. Mass.:
52607.65
Organism:
Homo sapiens (Human)
Description:
P28223
Residue:
471
  
Inhibitor
Name:
BDBM50547388
Synonyms:
CHEMBL4758966
Type:
Small organic molecule
Emp. Form.:
C22H24ClN3O
Mol. Mass.:
381.898
SMILES:
CCOc1ccc2Nc3ccc(Cl)cc3N=C(C3=C[C@H](C)N(C)CC3)c2c1
: