Target
Melanocortin receptor 5
Ligand
BDBM50105883
Substrate
Meas. Tech.
ChEMBL_220875 (CHEMBL824631)
EC50
0.220000±n/a nM
Citation
 Bednarek, MAMacNeil, TKalyani, RNTang, RVan der Ploeg, LHWeinberg, DH Selective, high affinity peptide antagonists of alpha-melanotropin action at human melanocortin receptor 4: their synthesis and biological evaluation in vitro. J Med Chem 44:3665-72 (2001)  
Target
Name:
Melanocortin receptor 5
Synonyms:
MC-2 MC5R Melanocortin MC5 Melanocortin receptor 5 | Melanocortin receptor 5 (MC5R)
Type:
Enzyme
Mol. Mass.:
36612.92
Organism:
Homo sapiens (Human)
Description:
P33032
Residue:
325
  
Inhibitor
Name:
BDBM50105883
Synonyms:
3-[25-Acetylamino-4-carbamoyl-13-(3-guanidino-propyl)-19-(3H-imidazol-4-ylmethyl)-10-(1H-indol-3-ylmethyl)-16-naphthalen-2-ylmethyl-6,9,12,15,18,21,24-heptaoxo-1,2-dithia-5,8,11,14,17,20,23-heptaaza-cyclohexacos-22-yl]-propionic acid | CHEMBL408843
Type:
Small organic molecule
Emp. Form.:
C51H63N15O11S2
Mol. Mass.:
1126.27
SMILES:
CC(=O)N[C@@H]1CSSC[C@H](NC(=O)CNC(=O)[C@@H](Cc2c[nH]c3ccccc23)NC(=O)[C@H](CCCNC(N)=N)NC(=O)[C@H](Cc2ccc3ccccc3c2)NC(=O)[C@H](Cc2cnc[nH]2)NC(=O)[C@@H](CCC(O)=O)NC1=O)C(N)=O
: