Target
5-hydroxytryptamine receptor 6
Ligand
BDBM50106261
Substrate
Meas. Tech.
ChEMBL_3611 (CHEMBL618094)
Ki
25±n/a nM
Citation
 Russell, MGBaker, RJBarden, LBeer, MSBristow, LBroughton, HBKnowles, MMcAllister, GPatel, SCastro, JL N-Arylsulfonylindole derivatives as serotonin 5-HT(6) receptor ligands. J Med Chem 44:3881-95 (2001)  
Target
Name:
5-hydroxytryptamine receptor 6
Synonyms:
5-HT-6 5-hydroxytryptamine receptor 6 (5-HT-6) 5-hydroxytryptamine receptor 6 (5HT6) HTR6 Serotonin 6 (5-HT6) receptor | Serotonin Receptor 6
Type:
G Protein-Coupled Receptor (GPCR)
Mol. Mass.:
46968.43
Organism:
Homo sapiens (Human)
Description:
P50406
Residue:
440
  
Inhibitor
Name:
BDBM50106261
Synonyms:
CHEMBL316881 | [3-(2-Dimethylamino-ethyl)-5-methoxy-indol-1-yl]-phenyl-methanone
Type:
Small organic molecule
Emp. Form.:
C20H22N2O2
Mol. Mass.:
322.4009
SMILES:
COc1ccc2n(cc(CCN(C)C)c2c1)C(=O)c1ccccc1
: