Target
5-hydroxytryptamine receptor 1D
Ligand
BDBM50106251
Substrate
Meas. Tech.
ChEMBL_1708 (CHEMBL616915)
Ki
4.5±n/a nM
Citation
 Russell, MGBaker, RJBarden, LBeer, MSBristow, LBroughton, HBKnowles, MMcAllister, GPatel, SCastro, JL N-Arylsulfonylindole derivatives as serotonin 5-HT(6) receptor ligands. J Med Chem 44:3881-95 (2001)  
Target
Name:
5-hydroxytryptamine receptor 1D
Synonyms:
5-HT-1D 5-HT1D 5HT1D_HUMAN HTR1DA Serotonin (5-HT) receptor | Serotonin Receptor 1D
Type:
G Protein-Coupled Receptor (GPCR)
Mol. Mass.:
41920.63
Organism:
Homo sapiens (Human)
Description:
Receptor binding assays were performed using human clone stably expressed in CHO cells.
Residue:
377
  
Inhibitor
Name:
BDBM50106251
Synonyms:
2-(1-Benzenesulfonyl-1H-indol-4-yl)-ethylamine | CHEMBL125745
Type:
Small organic molecule
Emp. Form.:
C16H16N2O2S
Mol. Mass.:
300.375
SMILES:
NCCc1cccc2n(ccc12)S(=O)(=O)c1ccccc1
: