Target
5-hydroxytryptamine receptor 6
Ligand
BDBM50106252
Substrate
Meas. Tech.
ChEMBL_3611 (CHEMBL618094)
Ki
54±n/a nM
Citation
 Russell, MGBaker, RJBarden, LBeer, MSBristow, LBroughton, HBKnowles, MMcAllister, GPatel, SCastro, JL N-Arylsulfonylindole derivatives as serotonin 5-HT(6) receptor ligands. J Med Chem 44:3881-95 (2001)  
Target
Name:
5-hydroxytryptamine receptor 6
Synonyms:
5-HT-6 5-hydroxytryptamine receptor 6 (5-HT-6) 5-hydroxytryptamine receptor 6 (5HT6) HTR6 Serotonin 6 (5-HT6) receptor | Serotonin Receptor 6
Type:
G Protein-Coupled Receptor (GPCR)
Mol. Mass.:
46968.43
Organism:
Homo sapiens (Human)
Description:
P50406
Residue:
440
  
Inhibitor
Name:
BDBM50106252
Synonyms:
CHEMBL263700 | [3-(2-Dimethylamino-ethyl)-5-hydroxy-indol-1-yl]-phenyl-methanone
Type:
Small organic molecule
Emp. Form.:
C19H20N2O2
Mol. Mass.:
308.3743
SMILES:
CN(C)CCc1cn(C(=O)c2ccccc2)c2ccc(O)cc12
: