Target
Tubulin alpha-1A chain
Ligand
BDBM50005480
Substrate
Meas. Tech.
ChEMBL_211875 (CHEMBL819257)
IC50
530±n/a nM
Citation
 Xia, YYang, ZYXia, PHackl, THamel, EMauger, AWu, JHLee, KH Antitumor Agents. 211. Fluorinated 2-phenyl-4-quinolone derivatives as antimitotic antitumor agents. J Med Chem 44:3932-6 (2001)  
Target
Name:
Tubulin alpha-1A chain
Synonyms:
TBA1A_PIG Tubulin Tubulin alpha-1A chain
Type:
Protein
Mol. Mass.:
50049.25
Organism:
Sus scrofa (Pig)
Description:
P02550
Residue:
451
  
Inhibitor
Name:
BDBM50005480
Synonyms:
(-)-combretastatin (Z)-5-(3,4,5-trimethoxystyryl)-2-methoxyphenol (combretastin A-4)2-Methoxy-5-[2-(3,4,5-trimethoxy-phenyl)-vinyl]-phenol 2-Methoxy-5-[(Z)-2-(3,4,5-trimethoxy-phenyl)-vinyl]-phenol 2-methoxy-5-(3,4,5-trimethoxystyryl)phenol 5-(3,4,5-trimethoxystyryl)-2-methoxyphenol CHEMBL67 Combrestatin A4 Combretastatin Combretastin A-4 combretastatin A-4, (CSA4) | combretastin A4
Type:
Small organic molecule
Emp. Form.:
C18H20O5
Mol. Mass.:
316.3484
SMILES:
COc1ccc(\C=C/c2cc(OC)c(OC)c(OC)c2)cc1O
: