Target
Peroxisome proliferator-activated receptor gamma
Ligand
BDBM50546868
Substrate
Meas. Tech.
ChEMBL_2016850 (CHEMBL4670428)
EC50
7000±n/a nM
Citation
 Hinnah, KWillems, SMorstein, JHeering, JHartrampf, FWWBroichhagen, JLeippe, PMerk, DTrauner, D Photohormones Enable Optical Control of the Peroxisome Proliferator-Activated Receptor ? (PPAR?). J Med Chem 63:10908-10920 (2020)  
Target
Name:
Peroxisome proliferator-activated receptor gamma
Synonyms:
NR1C3 PPAR-gamma PPARG_HUMAN Peroxisome proliferator-activated receptor gamma (PPAR gamma) Peroxisome proliferator-activated receptor gamma (PPARĪ³) peroxisome proliferator-activated receptor gamma isoform 2
Type:
Nuclear Receptor
Mol. Mass.:
57613.46
Organism:
Homo sapiens (Human)
Description:
P37231
Residue:
505
  
Inhibitor
Name:
BDBM50546868
Synonyms:
CHEMBL4799629
Type:
Small organic molecule
Emp. Form.:
C16H12ClN3O2S
Mol. Mass.:
345.803
SMILES:
Clc1ccc(cc1)\N=N/c1ccc(CC2SC(=O)NC2=O)cc1
: