Target
Peroxisome proliferator-activated receptor gamma
Ligand
BDBM50546869
Substrate
Meas. Tech.
ChEMBL_2016850 (CHEMBL4670428)
EC50
6500±n/a nM
Citation
 Hinnah, KWillems, SMorstein, JHeering, JHartrampf, FWWBroichhagen, JLeippe, PMerk, DTrauner, D Photohormones Enable Optical Control of the Peroxisome Proliferator-Activated Receptor ? (PPAR?). J Med Chem 63:10908-10920 (2020)  
Target
Name:
Peroxisome proliferator-activated receptor gamma
Synonyms:
NR1C3 PPAR-gamma PPARG_HUMAN Peroxisome proliferator-activated receptor gamma (PPAR gamma) Peroxisome proliferator-activated receptor gamma (PPARĪ³) peroxisome proliferator-activated receptor gamma isoform 2
Type:
Nuclear Receptor
Mol. Mass.:
57613.46
Organism:
Homo sapiens (Human)
Description:
P37231
Residue:
505
  
Inhibitor
Name:
BDBM50546869
Synonyms:
CHEMBL4792982
Type:
Small organic molecule
Emp. Form.:
C17H12F3N3O2S
Mol. Mass.:
379.356
SMILES:
FC(F)(F)c1ccc(cc1)\N=N/c1ccc(CC2SC(=O)NC2=O)cc1
: