Target
Botulinum neurotoxin type A
Ligand
BDBM50546870
Substrate
Meas. Tech.
ChEMBL_2016878 (CHEMBL4670456)
Ki
8900±n/a nM
Citation
 Lin, LOlson, MESugane, TTurner, LDTararina, MANielsen, ALKurbanov, EKPellett, SJohnson, EACohen, SMAllen, KNJanda, KD Catch and Anchor Approach To Combat Both Toxicity and Longevity of Botulinum Toxin A. J Med Chem 63:11100-11120 (2020)  
Target
Name:
Botulinum neurotoxin type A
Synonyms:
BXA1_CLOBO bonT | botA
Type:
PROTEIN
Mol. Mass.:
149450.01
Organism:
Clostridium botulinum
Description:
ChEMBL_1510137
Residue:
1296
  
Inhibitor
Name:
BDBM50546870
Synonyms:
CHEMBL4790141
Type:
Small organic molecule
Emp. Form.:
C15H19Cl2NO4S2
Mol. Mass.:
412.352
SMILES:
CS(=O)(=O)SCCCCCN(O)C(=O)\C=C\c1ccc(Cl)cc1Cl
: