Target
Intermediate conductance calcium-activated potassium channel protein 4
Ligand
BDBM50547898
Substrate
Meas. Tech.
ChEMBL_2019386 (CHEMBL4672964)
IC50
14±n/a nM
Citation
 Blass, BE Novel Potassium Channel Inhibitors. ACS Med Chem Lett 11:2357-2358 (2020)  
Target
Name:
Intermediate conductance calcium-activated potassium channel protein 4
Synonyms:
IK1 KCA4 KCNN4_HUMAN SK4
Type:
PROTEIN
Mol. Mass.:
47723.22
Organism:
Homo sapiens (Human)
Description:
ChEMBL_1361891
Residue:
427
  
Inhibitor
Name:
BDBM50547898
Synonyms:
CHEMBL4788143 | US20240034717, Example 31.37
Type:
Small organic molecule
Emp. Form.:
C18H24F4N2
Mol. Mass.:
344.3902
SMILES:
CC(C)(N)CN(CC1CC1)C1(CC1)c1ccc(F)c(c1)C(F)(F)F
: