Target
Intermediate conductance calcium-activated potassium channel protein 4
Ligand
BDBM50547901
Substrate
Meas. Tech.
ChEMBL_2019386 (CHEMBL4672964)
IC50
47±n/a nM
Citation
 Blass, BE Novel Potassium Channel Inhibitors. ACS Med Chem Lett 11:2357-2358 (2020)  
Target
Name:
Intermediate conductance calcium-activated potassium channel protein 4
Synonyms:
IK1 KCA4 KCNN4_HUMAN SK4
Type:
PROTEIN
Mol. Mass.:
47723.22
Organism:
Homo sapiens (Human)
Description:
ChEMBL_1361891
Residue:
427
  
Inhibitor
Name:
BDBM50547901
Synonyms:
CHEMBL4745327 | US20240034717, Example 31.48
Type:
Small organic molecule
Emp. Form.:
C17H22F4N2O2
Mol. Mass.:
362.3624
SMILES:
CCOC(=O)N(CC(C)(C)N)C1(CC1)c1ccc(F)c(c1)C(F)(F)F
: