Target
Substance-P receptor
Ligand
BDBM50106901
Substrate
Meas. Tech.
ChEBML_205389
IC50
0.500000±n/a nM
Citation
 Gerspacher, MLa Vecchia, LMah, Rvon Sprecher, AAnderson, GPSubramanian, NHauser, KBammerlin, HKimmel, SPawelzik, VRyffel, KBall, HA Dual neurokinin NK(1)/NK(2) antagonists: N-[(R,R)-(E)-1-arylmethyl-3-(2-oxo-azepan-3-yl)carbamoyl]allyl-N-methyl-3,5-bis(trifluoromethyl)benzamides and 3-[N'-3,5-bis(trifluoromethyl)benzoyl-N-arylmethyl-N'-methylhydrazino]-N-[(R)-2-oxo-azepan-3-yl]propionamides. Bioorg Med Chem Lett 11:3081-4 (2001)  
Target
Name:
Substance-P receptor
Synonyms:
NK-1 receptor NK1 Receptor NK1R_HUMAN Neurokinin-1 (NK-1) SPR TACR1 Tachykinin receptor 1 (NK1) | tachykinin
Type:
G Protein-Coupled Receptor (GPCR)
Mol. Mass.:
46254.43
Organism:
Homo sapiens (Human)
Description:
P25103
Residue:
407
  
Inhibitor
Name:
BDBM50106901
Synonyms:
CHEMBL104954 | N-[(E)-(R)-1-(4-Chloro-benzyl)-3-((R)-2-oxo-azepan-3-ylcarbamoyl)-allyl]-N-methyl-3,5-bis-trifluoromethyl-benzamide
Type:
Small organic molecule
Emp. Form.:
C27H26ClF6N3O3
Mol. Mass.:
589.957
SMILES:
CN([C@H](Cc1ccc(Cl)cc1)\C=C\C(=O)N[C@@H]1CCCCNC1=O)C(=O)c1cc(cc(c1)C(F)(F)F)C(F)(F)F
: