Target
Insulin receptor
Ligand
BDBM50548048
Substrate
Meas. Tech.
ChEMBL_2019764 (CHEMBL4673577)
EC50
12±n/a nM
Citation
 Turner, AKaas, QCraik, DJ Hormone-like conopeptides - new tools for pharmaceutical design. RSC Med Chem 11:1235-1251 (2020)  
Target
Name:
Insulin receptor
Synonyms:
INSR INSR_HUMAN Insulin receptor beta subunit
Type:
Receptor Tyrosine Kinase
Mol. Mass.:
156322.60
Organism:
Homo sapiens (Human)
Description:
P06213
Residue:
1382
  
Inhibitor
Name:
BDBM50548048
Synonyms:
CHEMBL4764550
Type:
Small organic molecule
Emp. Form.:
C207H303N63O72S7
Mol. Mass.:
5050.455
SMILES:
CC[C@H](C)[C@@H]1NC(=O)[C@H](CCC(N)=O)NC(=O)[C@H](CO)NC(=O)CNC(=O)[C@@H]2CSSC[C@@H]3NC(=O)[C@H](CSSC[C@H](NC(=O)[C@H](C)NC(=O)[C@H](CCCNC(N)=N)NC(=O)[C@H](CCCCN)NC3=O)C(=O)N[C@@H](CO)C(=O)N[C@@H](CC(N)=O)C(=O)N[C@@H](C)C(=O)N[C@@H](CC(C(O)=O)C(O)=O)C(=O)N[C@@H](Cc3ccccc3)C(=O)N[C@@H](CCSC)C(=O)N[C@@H](CCC(N)=O)C(=O)N[C@@H](Cc3ccccc3)C(=O)N[C@@H](CSSC[C@H](NC(=O)[C@H](CC(C)C)NC(=O)[C@H](CC(C(O)=O)C(O)=O)NC(=O)[C@H](CCCNC(N)=N)NC(=O)[C@H](Cc3ccc(O)cc3)NC(=O)[C@H](CO)NC(=O)[C@H](CC(O)=O)NC(=O)[C@@H](NC1=O)[C@@H](C)O)C(=O)N1CCC[C@H]1C(=O)N[C@@H](Cc1cnc[nH]1)C(O)=O)C(=O)N[C@@H](CC(N)=O)C(=O)N[C@@H](CO)C(=O)N[C@@H](CC(O)=O)C(=O)N[C@@H]([C@@H](C)O)C(=O)N1CCC[C@H]1C(=O)N[C@@H](Cc1c[nH]c3ccccc13)C(=O)N[C@@H](CC(N)=O)C(=O)N[C@@H](CCCNC(N)=N)C(=O)N2)NC(=O)[C@H](Cc1cnc[nH]1)NC(=O)[C@H](CC(C(O)=O)C(O)=O)NC(=O)[C@@H](NC(=O)[C@@H](NC(=O)CN)C(C)C)C(C)C
: