Target
Insulin receptor
Ligand
BDBM50548051
Substrate
Meas. Tech.
ChEMBL_2019764 (CHEMBL4673577)
EC50
12±n/a nM
Citation
 Turner, AKaas, QCraik, DJ Hormone-like conopeptides - new tools for pharmaceutical design. RSC Med Chem 11:1235-1251 (2020)  
Target
Name:
Insulin receptor
Synonyms:
INSR INSR_HUMAN Insulin receptor beta subunit
Type:
Receptor Tyrosine Kinase
Mol. Mass.:
156322.60
Organism:
Homo sapiens (Human)
Description:
P06213
Residue:
1382
  
Inhibitor
Name:
BDBM50548051
Synonyms:
CHEMBL4748140
Type:
Small organic molecule
Emp. Form.:
C103H148N26O29
Mol. Mass.:
2214.434
SMILES:
CC[C@H](C)[C@H](NC(=O)[C@H](CC(C)C)NC(=O)[C@@H](Cc1ccc(O)cc1)NC(=O)[C@H](CCC(N)=O)NC(=O)[C@H](CC(N)=O)NC(=O)[C@H](Cc1ccc(O)cc1)NC(=O)[C@H](CCC(N)=O)NC(=O)[C@H](CC(C)C)NC(=O)[C@@H](Cc1ccc(O)cc1)NC(=O)[C@@H](Cc1ccc(O)cc1)NC(=O)[C@H](CCC(O)=O)NC(=O)CN)C(=O)N[C@@H](CCCNC(N)=N)C(=O)N[C@H](Cc1ccc(O)cc1)C(=O)N[C@@H](CCCCN)C(=O)N[C@@H](CO)C(=O)N[C@@H](CC(N)=O)C(N)=O
: