Target
Cystathionine beta-synthase
Ligand
BDBM60996
Substrate
Meas. Tech.
ChEMBL_2021451 (CHEMBL4675264)
IC50
>650000±n/a nM
Citation
 Hu, YWang, LHan, XZhou, YZhang, TWang, LHong, TZhang, WGuo, XXSun, JQi, YYu, JLiu, HWu, F Discovery of a Bioactive Inhibitor with a New Scaffold for Cystathionine ?-Lyase. J Med Chem 62:1677-1683 (2019)  
Target
Name:
Cystathionine beta-synthase
Synonyms:
Beta-thionase CBS_HUMAN | Serine sulfhydrase
Type:
PROTEIN
Mol. Mass.:
60586.85
Organism:
Homo sapiens (Human)
Description:
ChEMBL_109567
Residue:
551
  
Inhibitor
Name:
BDBM60996
Synonyms:
5-[(3-carboxy-4-hydroxy-phenyl)-(3-carboxy-4-keto-cyclohexa-2,5-dien-1-ylidene)methyl]-2-hydroxy-benzoic acid 5-[(3-carboxy-4-hydroxyphenyl)-(3-carboxy-4-oxocyclohexa-2,5-dien-1-ylidene)methyl]-2-hydroxybenzoic acid Aurintricarboxylic acid SMR000326731 | cid_2259
Type:
Small organic molecule
Emp. Form.:
C22H14O9
Mol. Mass.:
422.3412
SMILES:
[#8]-[#6](=O)-[#6]-1=[#6]\[#6](-[#6]=[#6]-[#6]-1=O)=[#6](\c1ccc(-[#8])c(c1)-[#6](-[#8])=O)-c1ccc(-[#8])c(c1)-[#6](-[#8])=O
: