Target
Muscarinic acetylcholine receptor M4
Ligand
BDBM50107712
Substrate
Meas. Tech.
ChEMBL_139105 (CHEMBL749229)
EC50
1100±n/a nM
Citation
 Rajeswaran, WGCao, YHuang, XPWroblewski, MEColclough, TLee, SLiu, FNagy, PIEllis, JLevine, BANocka, KHMesser, WS Design, synthesis, and biological characterization of bivalent 1-methyl-1,2,5,6-tetrahydropyridyl-1,2,5-thiadiazole derivatives as selective muscarinic agonists. J Med Chem 44:4563-76 (2001)  
Target
Name:
Muscarinic acetylcholine receptor M4
Synonyms:
ACM4_HUMAN Cholinergic, muscarinic M4 Muscarinic acetylcholine receptor M2 and M4
Type:
Enzyme Catalytic Domain
Mol. Mass.:
53079.31
Organism:
Homo sapiens (Human)
Description:
Cholinergic, muscarinic M4 CHRM4 HUMAN M3::P08173
Residue:
479
  
Inhibitor
Name:
BDBM50107712
Synonyms:
1,10-di[4-(1-methyl-1,2,3,6-tetrahydro-5-pyridinyl)-1,2,5-thiadiazol-3-yloxy]decane | CHEMBL143468
Type:
Small organic molecule
Emp. Form.:
C26H40N6O2S2
Mol. Mass.:
532.765
SMILES:
CN1CCC=C(C1)c1nsnc1OCCCCCCCCCCOc1nsnc1C1=CCCN(C)C1
: