Target
Dihydrofolate reductase
Ligand
BDBM50050412
Substrate
Meas. Tech.
ChEMBL_55100 (CHEMBL665360)
IC50
0.93±n/a nM
Citation
 Debnath, AK Pharmacophore mapping of a series of 2,4-diamino-5-deazapteridine inhibitors of Mycobacterium avium complex dihydrofolate reductase. J Med Chem 45:41-53 (2001)  
Target
Name:
Dihydrofolate reductase
Synonyms:
DHFR Dihydrofolate reductase (DHFR) | Tetrahydrofolate dehydrogenase
Type:
Enzyme
Mol. Mass.:
21453.99
Organism:
Homo sapiens (Human)
Description:
Recombinant human DHFR.
Residue:
187
  
Inhibitor
Name:
BDBM50050412
Synonyms:
5-Methyl-6-[(5,6,7,8-tetrahydro-naphthalen-1-ylamino)-methyl]-pyrido[2,3-d]pyrimidine-2,4-diamine | CHEMBL282948
Type:
Small organic molecule
Emp. Form.:
C19H22N6
Mol. Mass.:
334.4182
SMILES:
Cc1c(CNc2cccc3CCCCc23)cnc2nc(N)nc(N)c12
: