Target
Dihydrofolate reductase
Ligand
BDBM50107983
Substrate
Meas. Tech.
ChEMBL_55100 (CHEMBL665360)
IC50
0.76±n/a nM
Citation
 Debnath, AK Pharmacophore mapping of a series of 2,4-diamino-5-deazapteridine inhibitors of Mycobacterium avium complex dihydrofolate reductase. J Med Chem 45:41-53 (2001)  
Target
Name:
Dihydrofolate reductase
Synonyms:
DHFR Dihydrofolate reductase (DHFR) | Tetrahydrofolate dehydrogenase
Type:
Enzyme
Mol. Mass.:
21453.99
Organism:
Homo sapiens (Human)
Description:
Recombinant human DHFR.
Residue:
187
  
Inhibitor
Name:
BDBM50107983
Synonyms:
5-Methyl-6-(naphthalen-2-ylaminomethyl)-pyrido[2,3-d]pyrimidine-2,4-diamine | CHEMBL151367
Type:
Small organic molecule
Emp. Form.:
C19H18N6
Mol. Mass.:
330.3864
SMILES:
Cc1c(CNc2ccc3ccccc3c2)cnc2nc(N)nc(N)c12
: