Target
Calcitonin gene-related peptide type 1 receptor
Ligand
BDBM50548651
Substrate
Meas. Tech.
ChEMBL_2022773 (CHEMBL4676586)
Ki
6.0±n/a nM
Citation
 Mercer, SEChaturvedula, PVConway, CMCook, DADavis, CDPin, SSMacci, RSchartman, RSignor, LJWidmann, KAWhiterock, VJChen, PXu, CHerbst, JJKostich, WAThalody, GMacor, JEDubowchik, GM Azepino-indazoles as calcitonin gene-related peptide (CGRP) receptor antagonists. Bioorg Med Chem Lett 31:0 (2021)  
Target
Name:
Calcitonin gene-related peptide type 1 receptor
Synonyms:
Adrenomedullin receptor AM1; CALCRL/RAMP2 CALRL_HUMAN CGRP type 1 receptor mRNA Calcitonin gene-related peptide (CGRP) receptor Calcitonin receptor-like receptor Human CL receptor
Type:
Enzyme Catalytic Domain
Mol. Mass.:
52980.45
Organism:
Homo sapiens (Human)
Description:
Q16602
Residue:
461
  
Inhibitor
Name:
BDBM50548651
Synonyms:
CHEMBL4785845
Type:
Small organic molecule
Emp. Form.:
C29H26ClF4N5O3
Mol. Mass.:
603.995
SMILES:
Fc1cccc2cc(C3CCN(CC3)C(=O)C[C@@H]3Cc4cc(Cl)c5[nH]ncc5c4CN(CC(F)(F)F)C3=O)c(=O)[nH]c12
: