Target
Calcitonin gene-related peptide type 1 receptor
Ligand
BDBM50548658
Substrate
Meas. Tech.
ChEMBL_2022773 (CHEMBL4676586)
Ki
1.5±n/a nM
Citation
 Mercer, SEChaturvedula, PVConway, CMCook, DADavis, CDPin, SSMacci, RSchartman, RSignor, LJWidmann, KAWhiterock, VJChen, PXu, CHerbst, JJKostich, WAThalody, GMacor, JEDubowchik, GM Azepino-indazoles as calcitonin gene-related peptide (CGRP) receptor antagonists. Bioorg Med Chem Lett 31:0 (2021)  
Target
Name:
Calcitonin gene-related peptide type 1 receptor
Synonyms:
Adrenomedullin receptor AM1; CALCRL/RAMP2 CALRL_HUMAN CGRP type 1 receptor mRNA Calcitonin gene-related peptide (CGRP) receptor Calcitonin receptor-like receptor Human CL receptor
Type:
Enzyme Catalytic Domain
Mol. Mass.:
52980.45
Organism:
Homo sapiens (Human)
Description:
Q16602
Residue:
461
  
Inhibitor
Name:
BDBM50548658
Synonyms:
CHEMBL4798946
Type:
Small organic molecule
Emp. Form.:
C30H36ClN7O3
Mol. Mass.:
578.105
SMILES:
CC(C)(C)CN1Cc2c(C[C@@H](NC(=O)N3CCC(CC3)N3Cc4ccccc4NC3=O)C1=O)cc(Cl)c1[nH]ncc21
: