Target
Calcitonin gene-related peptide type 1 receptor
Ligand
BDBM50548659
Substrate
Meas. Tech.
ChEMBL_2022773 (CHEMBL4676586)
Ki
1.000000±n/a nM
Citation
 Mercer, SEChaturvedula, PVConway, CMCook, DADavis, CDPin, SSMacci, RSchartman, RSignor, LJWidmann, KAWhiterock, VJChen, PXu, CHerbst, JJKostich, WAThalody, GMacor, JEDubowchik, GM Azepino-indazoles as calcitonin gene-related peptide (CGRP) receptor antagonists. Bioorg Med Chem Lett 31:0 (2021)  
Target
Name:
Calcitonin gene-related peptide type 1 receptor
Synonyms:
Adrenomedullin receptor AM1; CALCRL/RAMP2 CALRL_HUMAN CGRP type 1 receptor mRNA Calcitonin gene-related peptide (CGRP) receptor Calcitonin receptor-like receptor Human CL receptor
Type:
Enzyme Catalytic Domain
Mol. Mass.:
52980.45
Organism:
Homo sapiens (Human)
Description:
Q16602
Residue:
461
  
Inhibitor
Name:
BDBM50548659
Synonyms:
CHEMBL4777037
Type:
Small organic molecule
Emp. Form.:
C32H32ClN7O3
Mol. Mass.:
598.095
SMILES:
Clc1cc2C[C@@H](NC(=O)N3CCC(CC3)N3Cc4ccccc4NC3=O)C(=O)N(Cc3ccccc3)Cc2c2cn[nH]c12
: