Target
Calcitonin gene-related peptide type 1 receptor
Ligand
BDBM50548663
Substrate
Meas. Tech.
ChEMBL_2022773 (CHEMBL4676586)
Ki
290±n/a nM
Citation
 Mercer, SEChaturvedula, PVConway, CMCook, DADavis, CDPin, SSMacci, RSchartman, RSignor, LJWidmann, KAWhiterock, VJChen, PXu, CHerbst, JJKostich, WAThalody, GMacor, JEDubowchik, GM Azepino-indazoles as calcitonin gene-related peptide (CGRP) receptor antagonists. Bioorg Med Chem Lett 31:0 (2021)  
Target
Name:
Calcitonin gene-related peptide type 1 receptor
Synonyms:
Adrenomedullin receptor AM1; CALCRL/RAMP2 CALRL_HUMAN CGRP type 1 receptor mRNA Calcitonin gene-related peptide (CGRP) receptor Calcitonin receptor-like receptor Human CL receptor
Type:
Enzyme Catalytic Domain
Mol. Mass.:
52980.45
Organism:
Homo sapiens (Human)
Description:
Q16602
Residue:
461
  
Inhibitor
Name:
BDBM50548663
Synonyms:
CHEMBL4792127
Type:
Small organic molecule
Emp. Form.:
C30H36N8O3
Mol. Mass.:
556.6586
SMILES:
O=C(N[C@@H]1Cc2ccc3[nH]ncc3c2CN(C2CCNCC2)C1=O)N1CCC(CC1)N1Cc2ccccc2NC1=O
: