Target
Neuronal acetylcholine receptor subunit alpha-3/beta-4
Ligand
BDBM50049757
Substrate
Meas. Tech.
ChEMBL_2022957 (CHEMBL4676770)
Ki
0.230000±n/a nM
Citation
 Lin, SXCurtis, MASperry, J Pyridine alkaloids with activity in the central nervous system. Bioorg Med Chem 28:0 (2020)  
Target
Name:
Neuronal acetylcholine receptor subunit alpha-3/beta-4
Synonyms:
Neuronal acetylcholine receptor protein alpha-3/beta-4 subunit | Neuronal acetylcholine receptor; alpha3/beta4
Type:
Mol. Mass.:
Description:
ASSAY_ID of ChEMBL is 1970247
Components:
This complex has 2 components.
Component 1
Name:
Neuronal acetylcholine receptor subunit beta-4
Synonyms:
ACHB4_HUMAN Cholinergic, Nicotinic Alpha6Beta3Beta4Alpha5 Nicotinic acetylcholine receptor alpha6/alpha3/beta4
Type:
Enzyme Catalytic Domain
Mol. Mass.:
56388.51
Organism:
Homo sapiens (Human)
Description:
Cholinergic, Nicotinic Alpha6Beta3Beta4Alpha5 0 HUMAN::P30926
Residue:
498
  
Component 2
Name:
Neuronal acetylcholine receptor subunit alpha-3
Synonyms:
ACHA3_HUMAN Cholinergic, Nicotinic Alpha3Beta2 Cholinergic, Nicotinic Alpha3Beta4x NACHRA3 Neuronal acetylcholine receptor subunit alpha-3 nicotinic central
Type:
Enzyme Catalytic Domain
Mol. Mass.:
57479.03
Organism:
Homo sapiens (Human)
Description:
Cholinergic, Nicotinic Alpha3Beta2 0 HUMAN::P32297
Residue:
505
  
Inhibitor
Name:
BDBM50049757
Synonyms:
()-2-(6-Chloro-pyridin-3-yl)-7-aza-bicyclo[2.2.1]heptane (+)-epibatidine (1R,2R,4S)-epibatidine (2R,4S)-2-(6-Chloro-pyridin-3-yl)-7-aza-bicyclo[2.2.1]heptane (2R,4S)-2-(6-chloropyridin-3-yl)-7-aza-bicyclo[2.2.1]heptane (R)-2-(6-Chloro-pyridin-3-yl)-7-methyl-7-aza-bicyclo[2.2.1]heptane 2-(6-Chloro-pyridin-3-yl)-7-aza-bicyclo[2.2.1]heptane 2-(6-Chloro-pyridin-3-yl)-7-aza-bicyclo[2.2.1]heptane(+/-) epibatidine 2-(6-Chloro-pyridin-3-yl)-7-azonia-bicyclo[2.2.1]heptane 2-Pyridin-3-yl-7-aza-bicyclo[2.2.1]heptane EPIBATIDINE Epibatidine-(+) exo-2-(6-chloropyridin-3-yl)-7-aza-bicyclo[2.2.1]heptane | rac-(2R)-2-(6-chloropyridin-3-yl)-7-aza-bicyclo[2.2.1]heptane
Type:
Small organic molecule
Emp. Form.:
C11H13ClN2
Mol. Mass.:
208.687
SMILES:
Clc1ccc(cn1)C1CC2CCC1N2
: