Target
72 kDa type IV collagenase
Ligand
BDBM50108135
Substrate
Meas. Tech.
ChEMBL_104551 (CHEMBL718937)
IC50
0.098000±n/a nM
Citation
 Wada, CKHolms, JHCurtin, MLDai, YFlorjancic, ASGarland, RBGuo, YHeyman, HRStacey, JRSteinman, DHAlbert, DHBouska, JJElmore, INGoodfellow, CLMarcotte, PATapang, PMorgan, DWMichaelides, MRDavidsen, SK Phenoxyphenyl sulfone N-formylhydroxylamines (retrohydroxamates) as potent, selective, orally bioavailable matrix metalloproteinase inhibitors. J Med Chem 45:219-32 (2001)  
Target
Name:
72 kDa type IV collagenase
Synonyms:
72 kDa gelatinase CLG4A Gelatinase A (MMP-2) MMP2_HUMAN Matrix metalloproteinase-2 (MMP 2) Matrix metalloproteinases 2 (MMP-2) | TBE-1
Type:
Enzyme
Mol. Mass.:
73870.36
Organism:
Homo sapiens (Human)
Description:
P08253
Residue:
660
  
Inhibitor
Name:
BDBM50108135
Synonyms:
2-(Formyl-hydroxy-amino)-3-[4-(4-trifluoromethoxy-phenoxy)-benzenesulfonyl]-propane-1-sulfonic acid dimethylamide | CHEMBL311141
Type:
Small organic molecule
Emp. Form.:
C19H21F3N2O8S2
Mol. Mass.:
526.504
SMILES:
CN(C)S(=O)(=O)CC(CS(=O)(=O)c1ccc(Oc2ccc(OC(F)(F)F)cc2)cc1)N(O)C=O
: