Target
Delta-type opioid receptor
Ligand
BDBM50108346
Substrate
Meas. Tech.
ChEMBL_146921 (CHEMBL757313)
Ki
0.700000±n/a nM
Citation
 Yu, HPrisinzano, TDersch, CMMarcus, JRothman, RBJacobson, AERice, KC Synthesis and biological activity of 8beta-substituted hydrocodone indole and hydromorphone indole derivatives. Bioorg Med Chem Lett 12:165-8 (2001)  
Target
Name:
Delta-type opioid receptor
Synonyms:
Cytochrome P450 3A4 Delta opioid receptor Delta-type opioid receptor (DOR) OPRD_RAT Opioid receptor Opioid receptors; mu & delta Ror-a | Voltage-gated potassium channel
Type:
G Protein-Coupled Receptor (GPCR)
Mol. Mass.:
40465.04
Organism:
Rattus norvegicus (rat)
Description:
Competition binding assays were using CHO-K1 cell membranes expressing the opioid receptor.
Residue:
372
  
Inhibitor
Name:
BDBM50108346
Synonyms:
CHEMBL295295 | Indole Derivative
Type:
Small organic molecule
Emp. Form.:
C24H24N2O2
Mol. Mass.:
372.4596
SMILES:
C[C@@H]1C2C3Cc4ccc(O)c5O[C@@H](c6[nH]c7ccccc7c16)C2(CCN3C)c45
: