Target
Kappa-type opioid receptor
Ligand
BDBM50108434
Substrate
Meas. Tech.
ChEBML_145109
IC50
5.3±n/a nM
Citation
 Semple, GAndersson, BMChhajlani, VGeorgsson, JJohansson, MLindschoten, MPontén, FRosenquist, ASörensen, HSwanson, LSwanson, M 3-Aryl pyridone derivatives. Potent and selective kappa opioid receptor agonists. Bioorg Med Chem Lett 12:197-200 (2001)  
Target
Name:
Kappa-type opioid receptor
Synonyms:
K-OR-1 Kappa-opioid receptor (KOR) Kappa-type opioid receptor (KOR) OPIATE Kappa OPRK1 kappa opioid receptor (KOR)
Type:
G Protein-Coupled Receptor (GPCR)
Mol. Mass.:
42648.76
Organism:
Homo sapiens (Human)
Description:
P41145
Residue:
380
  
Inhibitor
Name:
BDBM50108434
Synonyms:
3-[2-Oxo-1-(1-phenyl-2-pyrrolidin-1-yl-ethyl)-1,2-dihydro-pyridin-3-yl]-benzonitrile | CHEMBL64809
Type:
Small organic molecule
Emp. Form.:
C24H23N3O
Mol. Mass.:
369.4589
SMILES:
O=c1c(cccn1C(CN1CCCC1)c1ccccc1)-c1cccc(c1)C#N
: