Target
Kappa-type opioid receptor
Ligand
BDBM50108444
Substrate
Meas. Tech.
ChEBML_145109
IC50
34±n/a nM
Citation
 Semple, GAndersson, BMChhajlani, VGeorgsson, JJohansson, MLindschoten, MPontén, FRosenquist, ASörensen, HSwanson, LSwanson, M 3-Aryl pyridone derivatives. Potent and selective kappa opioid receptor agonists. Bioorg Med Chem Lett 12:197-200 (2001)  
Target
Name:
Kappa-type opioid receptor
Synonyms:
K-OR-1 Kappa-opioid receptor (KOR) Kappa-type opioid receptor (KOR) OPIATE Kappa OPRK1 kappa opioid receptor (KOR)
Type:
G Protein-Coupled Receptor (GPCR)
Mol. Mass.:
42648.76
Organism:
Homo sapiens (Human)
Description:
P41145
Residue:
380
  
Inhibitor
Name:
BDBM50108444
Synonyms:
1-(1-Phenyl-2-pyrrolidin-1-yl-ethyl)-3-(4-trifluoromethoxy-phenyl)-1H-pyridin-2-one | CHEMBL61426
Type:
Small organic molecule
Emp. Form.:
C24H23F3N2O2
Mol. Mass.:
428.4468
SMILES:
FC(F)(F)Oc1ccc(cc1)-c1cccn(C(CN2CCCC2)c2ccccc2)c1=O
: