Target
Serine/threonine-protein kinase ULK1
Ligand
BDBM379374
Substrate
Meas. Tech.
ChEMBL_2023820 (CHEMBL4677633)
IC50
50±n/a nM
Citation
 Ren, HBakas, NAVamos, MChaikuad, ALimpert, ASWimer, CDBrun, SNLambert, LJTautz, LCeleridad, MSheffler, DJKnapp, SShaw, RJCosford, NDP Design, Synthesis, and Characterization of an Orally Active Dual-Specific ULK1/2 Autophagy Inhibitor that Synergizes with the PARP Inhibitor Olaparib for the Treatment of Triple-Negative Breast Cancer. J Med Chem 63:14609-14625 (2020)  
Target
Name:
Serine/threonine-protein kinase ULK1
Synonyms:
ATG1 KIAA0722 ULK1_HUMAN hATG1
Type:
PROTEIN
Mol. Mass.:
112661.80
Organism:
Homo sapiens (Human)
Description:
ChEMBL_1510275
Residue:
1050
  
Inhibitor
Name:
BDBM379374
Synonyms:
2-((4-(cyclopropylamino)-5-(trifluoromethyl)pyrimidin-2-yl)amino)phenol US10774092, Example 255
Type:
Small organic molecule
Emp. Form.:
C14H13F3N4O
Mol. Mass.:
310.2744
SMILES:
Oc1ccccc1Nc1ncc(c(NC2CC2)n1)C(F)(F)F
: