Target
Serine/threonine-protein kinase ULK1
Ligand
BDBM379352
Substrate
Meas. Tech.
ChEMBL_2023820 (CHEMBL4677633)
IC50
14±n/a nM
Citation
 Ren, HBakas, NAVamos, MChaikuad, ALimpert, ASWimer, CDBrun, SNLambert, LJTautz, LCeleridad, MSheffler, DJKnapp, SShaw, RJCosford, NDP Design, Synthesis, and Characterization of an Orally Active Dual-Specific ULK1/2 Autophagy Inhibitor that Synergizes with the PARP Inhibitor Olaparib for the Treatment of Triple-Negative Breast Cancer. J Med Chem 63:14609-14625 (2020)  
Target
Name:
Serine/threonine-protein kinase ULK1
Synonyms:
ATG1 KIAA0722 ULK1_HUMAN hATG1
Type:
PROTEIN
Mol. Mass.:
112661.80
Organism:
Homo sapiens (Human)
Description:
ChEMBL_1510275
Residue:
1050
  
Inhibitor
Name:
BDBM379352
Synonyms:
N4-cyclopropyl-N2-(5-methoxypyridin-3-yl)-5-(trifluoromethyl) pyrimidine-2,4-diamine US10774092, Example 230
Type:
Small organic molecule
Emp. Form.:
C14H14F3N5O
Mol. Mass.:
325.2891
SMILES:
COc1cncc(Nc2ncc(c(NC3CC3)n2)C(F)(F)F)c1
: