Target
Serine/threonine-protein kinase ULK1
Ligand
BDBM379295
Substrate
Meas. Tech.
ChEMBL_2023820 (CHEMBL4677633)
IC50
34±n/a nM
Citation
 Ren, HBakas, NAVamos, MChaikuad, ALimpert, ASWimer, CDBrun, SNLambert, LJTautz, LCeleridad, MSheffler, DJKnapp, SShaw, RJCosford, NDP Design, Synthesis, and Characterization of an Orally Active Dual-Specific ULK1/2 Autophagy Inhibitor that Synergizes with the PARP Inhibitor Olaparib for the Treatment of Triple-Negative Breast Cancer. J Med Chem 63:14609-14625 (2020)  
Target
Name:
Serine/threonine-protein kinase ULK1
Synonyms:
ATG1 KIAA0722 ULK1_HUMAN hATG1
Type:
PROTEIN
Mol. Mass.:
112661.80
Organism:
Homo sapiens (Human)
Description:
ChEMBL_1510275
Residue:
1050
  
Inhibitor
Name:
BDBM379295
Synonyms:
US10266549, Example 182a | US10774092, Example 182a
Type:
Small organic molecule
Emp. Form.:
C13H11F3N6
Mol. Mass.:
308.2618
SMILES:
CNc1nc(Nc2cnc3[nH]ccc3c2)ncc1C(F)(F)F
: