Target
Serine/threonine-protein kinase ULK1
Ligand
BDBM379311
Substrate
Meas. Tech.
ChEMBL_2023820 (CHEMBL4677633)
IC50
14±n/a nM
Citation
 Ren, HBakas, NAVamos, MChaikuad, ALimpert, ASWimer, CDBrun, SNLambert, LJTautz, LCeleridad, MSheffler, DJKnapp, SShaw, RJCosford, NDP Design, Synthesis, and Characterization of an Orally Active Dual-Specific ULK1/2 Autophagy Inhibitor that Synergizes with the PARP Inhibitor Olaparib for the Treatment of Triple-Negative Breast Cancer. J Med Chem 63:14609-14625 (2020)  
Target
Name:
Serine/threonine-protein kinase ULK1
Synonyms:
ATG1 KIAA0722 ULK1_HUMAN hATG1
Type:
PROTEIN
Mol. Mass.:
112661.80
Organism:
Homo sapiens (Human)
Description:
ChEMBL_1510275
Residue:
1050
  
Inhibitor
Name:
BDBM379311
Synonyms:
N4-cyclopropyl-N2-(1H-indazol-5-yl)-5-(trifluoromethyl) pyrimidine-2,4-diamine US10774092, Example 195
Type:
Small organic molecule
Emp. Form.:
C15H13F3N6
Mol. Mass.:
334.2991
SMILES:
FC(F)(F)c1cnc(Nc2ccc3[nH]ncc3c2)nc1NC1CC1
: