Target
Gastrin/cholecystokinin type B receptor
Ligand
BDBM50024321
Substrate
Meas. Tech.
ChEMBL_2024092 (CHEMBL4677905)
EC50
0.430000±n/a nM
Citation
 Klingler, MHörmann, AARangger, CDesrues, LCastel, HGandolfo, Pvon Guggenberg, E Stabilization Strategies for Linear Minigastrin Analogues: Further Improvements  J Med Chem 63:14668-14679 (2020)  
Target
Name:
Gastrin/cholecystokinin type B receptor
Synonyms:
Cckbr Cholecystokinin B receptor GASR_RAT | Gastrin/cholecystokinin type B receptor
Type:
Enzyme Catalytic Domain
Mol. Mass.:
48980.43
Organism:
RAT
Description:
Cholecystokinin A CCKBR RAT::P30553
Residue:
452
  
Inhibitor
Name:
BDBM50024321
Synonyms:
3-{2-[2-(3-tert-Butoxycarbonylamino-propionylamino)-3-(1H-indol-3-yl)-propionylamino]-4-methylsulfanyl-butyrylamino}-N-(1-carbamoyl-2-phenyl-ethyl)-succinamic acid CHEMBL1328 PENTAGASTRIN | Peptavlon
Type:
Small organic molecule
Emp. Form.:
C37H49N7O9S
Mol. Mass.:
767.891
SMILES:
CSCC[C@H](NC(=O)[C@H](Cc1c[nH]c2ccccc12)NC(=O)CCNC(=O)OC(C)(C)C)C(=O)N[C@@H](CC(O)=O)C(=O)N[C@@H](Cc1ccccc1)C(N)=O
: