Target
Gastrin/cholecystokinin type B receptor
Ligand
BDBM50549227
Substrate
Meas. Tech.
ChEMBL_2024092 (CHEMBL4677905)
EC50
1.9±n/a nM
Citation
 Klingler, MHörmann, AARangger, CDesrues, LCastel, HGandolfo, Pvon Guggenberg, E Stabilization Strategies for Linear Minigastrin Analogues: Further Improvements  J Med Chem 63:14668-14679 (2020)  
Target
Name:
Gastrin/cholecystokinin type B receptor
Synonyms:
Cckbr Cholecystokinin B receptor GASR_RAT | Gastrin/cholecystokinin type B receptor
Type:
Enzyme Catalytic Domain
Mol. Mass.:
48980.43
Organism:
RAT
Description:
Cholecystokinin A CCKBR RAT::P30553
Residue:
452
  
Inhibitor
Name:
BDBM50549227
Synonyms:
CHEMBL4759105
Type:
Small organic molecule
Emp. Form.:
C72H94N14O20
Mol. Mass.:
1475.5986
SMILES:
CCCC[C@H](N(C)C(=O)[C@H](Cc1c[nH]c2ccccc12)NC(=O)CNC(=O)[C@@H]1CCCN1C(=O)[C@H](Cc1ccc(O)cc1)NC(=O)[C@@H](CCC(O)=O)NC(=O)CN1CCN(CC(O)=O)CCN(CC(O)=O)CCN(CC(O)=O)CC1)C(=O)N[C@@H](CC(O)=O)C(=O)N[C@@H](Cc1cccc2ccccc12)C(N)=O
: