Target
Tyrosinase
Ligand
BDBM50155444
Substrate
Meas. Tech.
ChEMBL_2024324 (CHEMBL4678137)
IC50
3810±n/a nM
Citation
 Rosa, GPPalmeira, AResende, DISPAlmeida, IFKane-Pagès, ABarreto, MCSousa, EPinto, MMM Xanthones for melanogenesis inhibition: Molecular docking and QSAR studies to understand their anti-tyrosinase activity. Bioorg Med Chem 29:0 (2021)  
Target
Name:
Tyrosinase
Synonyms:
LB24-AB SK29-AB TYRO_HUMAN | Tumor rejection antigen AB
Type:
Protein
Mol. Mass.:
60388.08
Organism:
Homo sapiens (Human)
Description:
P14679
Residue:
529
  
Inhibitor
Name:
BDBM50155444
Synonyms:
3-Hydroxy-4-methoxy-xanthen-9-one | CHEMBL185895
Type:
Small organic molecule
Emp. Form.:
C14H10O4
Mol. Mass.:
242.2268
SMILES:
COc1c(O)ccc2c1oc1ccccc1c2=O
: