Target
Potassium voltage-gated channel subfamily H member 2
Ligand
BDBM50463479
Substrate
Meas. Tech.
ChEMBL_2024610 (CHEMBL4678423)
IC50
>30000±n/a nM
Citation
 Bandarage, UKCourt, JGao, HNanthakumar, SCome, JHGiroux, SGreen, J ROCK inhibitors 4: Structure-activity relationship studies of 7-azaindole-based rho kinase (ROCK) inhibitors. Bioorg Med Chem Lett 33:0 (2021)  
Target
Name:
Potassium voltage-gated channel subfamily H member 2
Synonyms:
1,3-beta-glucan synthase component GLS2 ERG Eag-related protein 1 Ether-a-go-go-related gene (HERG) Ether-a-go-go-related gene potassium channel 1 Ether-a-go-go-related gene potassium channel 1 (hERG1) Ether-a-go-go-related protein 1 H-ERG KCNH2 Potassium voltage-gated channel subfamily H member 2 (hERG) Voltage-gated potassium channel subunit Kv11.1 hERG Potassium Channel 1 | putative potassium channel subunit
Type:
Multi-pass membrane protein
Mol. Mass.:
126672.65
Organism:
Homo sapiens (Human)
Description:
Q12809
Residue:
1159
  
Inhibitor
Name:
BDBM50463479
Synonyms:
CHEMBL4249925
Type:
Small organic molecule
Emp. Form.:
C19H17N5O3S2
Mol. Mass.:
427.5
SMILES:
CS(=O)(=O)Nc1cccc(CC(=O)Nc2nc(cs2)-c2c[nH]c3ncccc23)c1
: