Target
Bromodomain adjacent to zinc finger domain protein 1A
Ligand
BDBM50549623
Substrate
Meas. Tech.
ChEMBL_2025493 (CHEMBL4679306)
Kd
22000±n/a nM
Citation
 Yang, ZZhou, YZhong, L Discovery of BAZ1A bromodomain inhibitors with the aid of virtual screening and activity evaluation. Bioorg Med Chem Lett 33:0 (2021)  
Target
Name:
Bromodomain adjacent to zinc finger domain protein 1A
Synonyms:
ACF1 ATP-utilizing chromatin assembly and remodeling factor 1 BAZ1A_HUMAN CHRAC subunit ACF1 WCRF180 hACF1 | hWALp1
Type:
PROTEIN
Mol. Mass.:
178700.86
Organism:
Homo sapiens
Description:
ChEMBL_117342
Residue:
1556
  
Inhibitor
Name:
BDBM50549623
Synonyms:
CHEMBL4740971
Type:
Small organic molecule
Emp. Form.:
C16H13N3O4
Mol. Mass.:
311.2921
SMILES:
[O-][N+](=O)c1cccc(NC(=O)Nc2ccc3CCC(=O)c3c2)c1
: